*HEADING
cubit(Heat-Transfer-Study-Cubit.inp): 11/15/2025: 18:35:30
version: 2025.1
**
********************************** P A R T S **********************************
*PART, NAME=Part-Default
**
********************************** N O D E S **********************************
*NODE, NSET=ALLNODES
**
********************************** E L E M E N T S ****************************
*ELEMENT, TYPE=C3D8RT, ELSET=ht-beam
**
********************************** N O D E S E T S **********************************
*NSET, NSET=cold
*NSET, NSET=hot
**
********************************** P R O P E R T I E S ************************
*SOLID SECTION, ELSET=ht-beam, MATERIAL=Copper
**
*END PART
**
**
**
********************************** E N D   P A R T S **********************************
**
**
********************************** A S S E M B L Y ************************************
**
*ASSEMBLY, NAME=ASSEMBLY1
**
*INSTANCE, NAME=Part-Default_1, PART=Part-Default
*END INSTANCE
**
*END ASSEMBLY
**
**
**
*MATERIAL, NAME = Copper
*ELASTIC, TYPE=ISOTROPIC
0.000000e+00, 0.000000e+00
*DENSITY
0.000000e+00
*CONDUCTIVITY,TYPE=ISO
3.700000e+02
*SPECIFIC HEAT
0.000000e+00
**
**
************************************** H I S T O R Y *************************************
**
*PREPRINT
**
**************************************** S T E P 1 ***************************************
*STEP,INC=100,NAME=ht-study
**
*HEAT TRANSFER,END=SS
1, 1, 1e-05, 1, -1
**
**
*BOUNDARY, OP=MOD
Part-Default_1.cold, 11, , 3.800000e+02
*BOUNDARY, OP=MOD
Part-Default_1.hot, 11, , 5.000000e+02
**
**
**
*END STEP