*Heading
** Job name: Job-1 Model name: Model-1
** Generated by: Abaqus/CAE Learning Edition 2024
*Preprint, echo=NO, model=NO, history=NO, contact=NO
**
** PARTS
**
*Part, name=Part-1
*Node
*Element, type=DC3D8
*Nset, nset=Set-1, generate
*Elset, elset=Set-1, generate
** Section: Section-1
*Solid Section, elset=Set-1, material=Copper
*End Part
**
**
** ASSEMBLY
**
*Assembly, name=Assembly
**
*Instance, name=Part-1-1, part=Part-1
*End Instance
**
*Nset, nset=Set-1, instance=Part-1-1, generate
*Elset, elset=Set-1, instance=Part-1-1
*Nset, nset=Set-2, instance=Part-1-1, generate
*Elset, elset=Set-2, instance=Part-1-1
*End Assembly
**
** MATERIALS
**
*Material, name=Copper
*Conductivity
370.,
** ----------------------------------------------------------------
**
** STEP: Step-1
**
*Step, name=Step-1, nlgeom=NO
*Heat Transfer, steady state, deltmx=0.
1., 1., 1e-05, 1.,
**
** BOUNDARY CONDITIONS
**
** Name: BC-1 Type: Temperature
*Boundary
Set-1, 11, 11, 380.
** Name: BC-2 Type: Temperature
*Boundary
Set-2, 11, 11, 500.
**
** OUTPUT REQUESTS
**
*Restart, write, frequency=0
**
** FIELD OUTPUT: F-Output-1
**
*Output, field, variable=PRESELECT
*Output, history, frequency=0
*End Step